AndroidStudio 编译中遇到问题总结2

supertypes of the following classes cannot be resolved. make sure you have the required dependencies 目录1、问题2、出现这个问题的原因3、解决办法         1、问题 Android Studio 编译报错: Supertypes of the following classes cannot be resolved. Please make sure you have the required dependencies in the classpath : class X, unresolved supertypes: Y 重启且清除Android Stu 阅读详情

1、问题:Android Studio3.0以后,在项目编译的时候发现Gradle中报错了,错误如下,

Cannot set the value of read-only property 'outputFile' for ApkVariantOutputImpl_Decorated

原因:3.0里面批量修改APK名字的配置有变化

解决方法:可参考:Cannot set the value of read-only property 'outputFile' for ApkVariantOutputImpl_Decorated_uu00soldier的博客-CSDN博客

2、问题:AndroidStudio3.0 Unable to resolve dependency for ':app@betaUnitTest/compileClasspath': Could not

原因1:app的buildTypes 和依赖library中gradle的buildTypes设置的不一样,library中缺少debug

app中:
buildTypes {
        debug {
                ....
        }
        release {
                ....
        }
    }
library中:
 buildTypes {
        release {
                ....
        }
    }

​

解决方法:可参考:升级AndroidStudio3.0 Unable to resolve dependency for ':app@betaUnitTest/compileClasspath': Could not_你的小码哥哥的博客-CSDN博客

原因2:我遇到的是项目的build.gradle里repositories缺少google()

解决办法2:

项目中build.gradle有这句话么?别切google()和jcenter()都不能少
repositories {
        google()
        jcenter()
    }

3、问题:微信开放平台SDK的Demo运行时报错:Unable to resolve dependency for ':app@debug/compileClasspath': Could not download wechat-sdk-android-with-mta.jar (com.tencent.mm.opensdk:wechat-sdk-android-with-mta:5.1.6): No cached version available for offline modess

原因:gradle设置为了Offline模式

解决方法:gradle的Offline work不选中。如下图,

4、问题: 找不到符号 符号:   方法 checkSelfPermission(BaseActivity,String) 位置: 类 ContextCompat

原因:这个方法是为了解决Android6.0以上的运行时权限问题,这个错误是因为libs下存在android-suport-v4.jar包,和build.gradle中引入的v4包冲突了,所以会产生这上面的这种错误

解决方法:可参考,友盟集成中“找不到符号”问题的解决_「已注销」的博客-CSDN博客

5 Caused by: java.lang.RuntimeException: java.lang.RuntimeException: com.android.builder.dexing.DexArchiveMergerException: Unable to merge dex

原因:依赖library重复导致

解决方法:可参考,Unable to merge dex,专治Android Studio各种抽风!_快乐的神经病的博客-CSDN博客

6、问题:Warning: there were * unresolved references to classes or interfaces.

原因:代码warn 导致

解决方法:在proguard-rules.pro这个文件了加了一行

 -ignorewarnings

7、问题:Android 打包时出现 java.lang.OutOfMemoryError: GC overhead limit exceeded 的解决办法

原因:内存溢出

解决方法:在graldr中添加如下信息即可:

android {
      dexOptions {
            incremental true
            javaMaxHeapSize "4g"
        }

8、问题:Unable to load class 'org.gradle.api.internal.component.Usage'

原因:这是由于插件兼容问题导致的错误

解决方法:如果有com.novoda:bintray-release请把版本修改为0.5.0,如下图

9、问题:集成友盟分享(UShare),新浪微博出现崩溃,报错

java.lang.UnsatisfiedLinkError: dalvik.system.PathClassLoader[DexPathList[[zip file "/data/app/com.xuetangx.mobile-2/base.apk", zip file "/data/app/
...
/lib/arm64-v8a, /vendor/lib64, /system/lib64]]] couldn't find "libweibosdkcore.so"
 at java.lang.Runtime.loadLibrary(Runtime.java:367)
 at java.lang.System.loadLibrary(System.java:1076)

原因:其实有许多问题认真分析日志都可以看出来,入这个可以看到couldn't find "libweibosdkcore.so"。虽然你也有但是我们看到程序实在arm64-v8a中找的,而你的jniLib中没有,arm64-v8a是其他module有,所以不同意导致寻找不到

解决方法:统一不同module种CPU架构对应一个ABI:armeabi,armeabi-v7a,x86,mips,arm64- v8a,mips64,x86_64。如都是armeabi或armeabi-v7a

10、问题:retrofit 2.0 代码混淆后返回空数据

解决方法:使Entity数据不做混淆,如下图

11、问题:Failed to resolve: com.github.franmontiel:PersistentCookieJar:v1.0.1

解决方法:project的gradle中加入   maven { url "https://jitpack.io" },如下

allprojects {
    repositories {
        ...
        maven { url "https://jitpack.io" }
    }
}

12、问题:Could not find manifest-merger.jar (com.android.tools.build:manifest-merger:26.0.1

解决方法:在项目的build.gradle文件中使google()的位置在jcenter()的前面,如下

buildscript {
    repositories {
        maven {
            url "https://maven.google.com"
        }
        google()
        jcenter()

    }
    dependencies {
        classpath 'com.android.tools.build:gradle:3.0.1'
    }
}

// Allow plugins to declare Maven dependencies via build-extras.gradle.
allprojects {
    repositories {
        google()
        jcenter()
        mavenCentral()
    }
}

13、问题:Unexpected scopes found in folder '/Users/gaolei/gaolei/Android/Project/ppzc_app_android/ICarsclub/build/intermediates/transforms/AspectTransform/debug'. Required: SUB_PROJECTS. Found: EXTERNAL_LIBRARIES, PROJECT, SUB_PROJECTS

解决方式:去掉InstantRun,如下图

14、问题:No toolchains found in the NDK toolchains folder for ABI with prefix

解决方法:新版本的NDK与3.0及以前旧版的Android Gradle plugin插件不兼容,其实解决方法很简单,就是修改build.gradle中的红字部分,改为3.1以上版本即可,如下

dependencies {
    classpath 'com.android.tools.build:gradle:3.2.0'

    // NOTE: Do not place your application dependencies here; they belong
    // in the individual module build.gradle files
}

15、问题:com.android.builder.dexing.DexArchiveMergerException: Unable to merge dex

解决方法:

步骤一:在app: build.gradle中添加multidex配置

android {
    defaultConfig {
	    ...
        multiDexEnabled true
    }
    dexOptions {
        incremental true
    }
}
dependencies {
    ...
    compile 'com.android.support:multidex:1.0.3'
}

步骤二:继承MultiDexApplication 或者在Application的attachBaseContext方法中加入

MultiDex.install(this);

16、问题:项目依赖的sdk版本从26升级到28后报错,java.util.concurrent.ExecutionException: com.android.builder.internal.aapt.v2.Aapt2Exception: Android resource compilation failed

解决方法:app默认的依赖不全导致,可以把运行成功的app的默认依赖拷贝过来,如下

implementation fileTree(include: ['*.jar'], dir: 'libs')
    implementation 'com.android.support:appcompat-v7:28.0.0'
    implementation 'com.android.support:design:28.0.0'
    implementation 'com.android.support.constraint:constraint-layout:1.1.3'
    testImplementation 'junit:junit:4.12'
    androidTestImplementation 'com.android.support.test:runner:1.0.2'
    androidTestImplementation 'com.android.support.test.espresso:espresso-core:3.0.2'

17、问题:Execution failed for task ':app:mergeDebugResources'.

解决方法:由于logcat或者build没有给出具体详细的错误信息,无法轻易找出问题。因为和resource有关可使用命令:gradlew compileDebugSources --stacktrace -info。这样就会有详细的错误信息。其它错误信息可使用

'compileDebugAidl',
'compileDebugAndroidTestAidl',
'compileDebugAndroidTestJavaWithJavac',
'compileDebugAndroidTestNdk',
'compileDebugAndroidTestRenderscript',
'compileDebugAndroidTestShaders',
'compileDebugAndroidTestSources',
'compileDebugJavaWithJavac',
'compileDebugNdk',
'compileDebugRenderscript',
'compileDebugShaders',
'compileDebugSources',
'compileDebugUnitTestJavaWithJavac',
'compileDebugUnitTestSources'.

18、问题: Supertypes of the following classes cannot be resolved. Please make sure you have the required dependencies in the classpath:

解决方法:把library模块的依赖包implementation改为api,因为implementation依赖的包只能在本模块使用,api依赖的包可供其它模块使用

 implementation 'com.squareup.okhttp3:okhttp:3.14.2'
改为
api 'com.squareup.okhttp3:okhttp:3.14.2'

19、问题:Duplicate class android.support.v4...

解决方法:是因为项目中依赖的第三方library中由多个library有依赖android.support.v4导致重复,引起的错误。

可通过命令查看依赖:./gradlew -q sample:dependencies --configuration debugCompileClasspath

20、问题:倒入一个项目时,报错> Could not download gradle.jar (com.android.tools.build:gradle:3.5.3): No c。  Could not download baseLibrary.jar (com.android.databinding:baseLibrary:3.5.

解决方法:修改gradle版本为你已经编译成功项目的版本。有两个地方需要修改

a、 build.gradle文件中的

classpath 'com.android.tools.build:gradle:3.5.0

b、gradlew/wrapper/gradle-wrapper.properties文件中的

distributionUrl=https\://services.gradle.org/distributions/gradle-5.6.1-all.zip

21、问题:项目可以编译过,但是一片红找不到类

解决方法:1、重启AndroidStudio 2、如果重启不行就清AndroidStudio缓存,步骤File --> Invalidate Caches/Restart

22、问题:同步gradle时报错:A problem occurred configuring root project 'RecyclerView'.
> Could not resolve all artifacts for configuration ':classpath'.
   > Could not find com.android.tools.build:gradle:3.5.0.

解决方法:项目gradle中的 repositories 增加google()

 repositories {
        jcenter()
        google()
    }

23、问题:Gradle下载依赖库失败

解决方法:增加Gralde阿里云镜像

buildscript {
    repositories {
        maven { url 'https://maven.aliyun.com/repository/jcenter' }
        maven { url 'https://maven.aliyun.com/repository/google' }
        maven { url 'https://maven.aliyun.com/repository/central' }
        maven { url 'https://maven.aliyun.com/repository/gradle-plugin' }
        google()
        jcenter()
    }
    dependencies {
        classpath "com.android.tools.build:gradle:4.1.3"

        // NOTE: Do not place your application dependencies here; they belong
        // in the individual module build.gradle files
    }
}

allprojects {
    repositories {
        maven { url 'https://maven.aliyun.com/repository/jcenter' }
        maven { url 'https://maven.aliyun.com/repository/google' }
        maven { url 'https://maven.aliyun.com/repository/central' }
        maven { url 'https://maven.aliyun.com/repository/gradle-plugin' }
        google()
        jcenter()
    }
}

Android Studio 开发之 AS3.5.1 工程根目录下的build.gradle文件格式 该博客主要目的是备忘一下,android studio 3.5.1版本使用的gradle-5.4.1-all的正规配置: 1、工程根目录下的build.gradle, 配置如下: // Top-level build file where you can add configuration options common to all sub-projects/modules. builds... 阅读详情

相关推荐

Android Studio启动配置gradle遇到的问题

一、 第一次创建Android工程的时候,现配置gradle,但是一般会卡在 Download Gradle directly from http://services.gradle.org/distributions/gradle-1.10.all.zip 字样 解决方法: 找到 android-studio/plugins/android/lib/templates/gradl

zhouzhengting1的专栏 1840

Unable to load class ‘org.gradle.api.publication.maven.internal.MavenPomMetaInfoProvider‘

Downgrade your gradle version to 6.7.1.

Mr. David 专栏 2795

DreamCamera2移植AndroidStudio指南

这里的们选一个文件最大的combined/framework-minus-apex.jar,并将其放入build.gradle文件中描述的目录,并重命名为framework.jar。这里我们注释dream_camera_arrays_video_part.xml中的pref_camera_filter_display_key_array。对比发现同名key对应内容也一致,因些注释上述两个资源文件中的一个pref_camera_filter_display_key_array即可。

qq_15050521的博客 2156

关于Android导入开源项目:Error:Unable to load class 'org.gradle.api.publication.maven.internal.DefaultMavenFa

在导入开源项目时,有可能会要求需要maven插件,并报出一下错误: 对于没有安装maven插件的开发者来说,要去下载一个maven插件也许不困难,但是,有时候可能会像我一样懒,不去下载插件,那么我们可以试着这样做: 我在网上找了一些资料看一看,发现很多都是说把相关maven插件的classpath删除就OK了,其实不然。我的做法是: 1、删除关module下的build.gradle文件

清风哥哥的专栏 1万+

TASK02【datawhale组队学习】视觉感知与手眼协调,计算机视觉在机器人中应用,手眼标定算法实现,深度估计与3D重建

参考教程AI硬件与机器人技术教程:https://github.com/datawhalechina/ai-hardware-robotics视觉感知与手眼协调,计算机视觉在机器人中应用,手眼标定算法实现,深度估计与3D重建单目深度估计 (Monocular Depth Estimation)DPT 的全称是 Dense Prediction Transformer。

m0_52024881的博客 1189

Proteus 8.9仿真五路抢答器:从74LS148编码到NE555报警的保姆级电路拆解

本文详细解析了使用Proteus 8.9仿真五路抢答器的完整设计流程,从74LS148优先编码器到NE555定时报警电路。通过保姆级的电路拆解和芯片选型指南,帮助读者掌握数字电路中的编码、锁存、译码和定时等核心技术,实现稳定可靠的抢答系统仿真。

weixin_30836759的博客 375

AndroidStudio升级后编译项目出现Aapt2Exception异常的问题解决方案

升级Android studio之后,出现了aapt2异常问题,之前网上查找的解决方案是; 在项目根目录下的gradle.properties文件(如果没有,新建)中添加以下配置: android.enableAapt2=false,清理项目,重新编译,问题解决。 但是最近升级studio之后,提示该方法已经过时了,而且当时这个方法没新创建一个项目,都要添加,也就是说,这不是正确的解决办法,...

lbqcsdn的专栏 1673

用示波器抓取同步Buck自举电容波形:从充电回路到SW节点振铃的完整分析

本文通过实测TI TPS54561和MPS MPQ4572同步Buck芯片,详细解析了自举电容在充电、维持和放电三个工作阶段的波形特征。重点揭示了电感泄放回路与充电回路重叠时,在SW节点引发的振铃现象及其产生机理,并提供了串联阻尼电阻等有效的工程抑制方法。文章结合示波器实测,为硬件工程师提供了从波形观测到问题调试的完整实践指南。

weixin_29276847的博客 367

Android Studio 怎么添加使用第三方jar包及无法编译的问题解决方法

一直在考虑着写博客什么的,估计有好几年了吧。好吧,我承认我很懒啦o(╯□╰)o,那么就先从一篇转载开始吧 原文地址 在使用Android Studio添加第三方包 ksoap2-android-assembly-3.0.0-jar-with-dependencies.jar,操作方法为: 1、将jar包放入项目里的libs文件夹中; 2、在project选中该jar包,

shadow066的专栏 9418

将ue4程序嵌入qt界面显示

需求:将ue4程序嵌入qt界面显示 思路:通过使用 windowsAPI 对ue4窗口进行设置跟随qt界面以及活动窗口时的位置层序设置

weixin_44342705的博客 5840

k8s重装1.28.2+calico+踩坑收集+InPlacePodVerticalScaling

它提供了从镜像构建(通过 Dockerfile)、镜像管理(上传、下载、存储等)、容器创建、运行、网络配置(可以为容器分配自定义的网络,如 bridge 网络、host 网络等)到容器编排(通过 Docker Compose 可以简单地编排多个容器的启动和关联关系)等一整套完整的解决方案。它的核心功能是启动和管理容器的生命周期。sudo apt update这个可以经常用,是来更新软件包的,它不下载,所以没风险,但是经常会报错,别问,问就是某种强大的力量,所以用镜像或者代理或者巴拉巴拉。

SsjjsS2019的博客 2549

AndroidStudio3.2版本自定义apk名称编译异常问题

项目从3.x版本升级到3.2版本时原有的自定义输出apk名称的代码已经失效新的写法更改为 //这段脚本是写在项目级别的gradle文件中的 // AS3.2版本//输出apk自定义名称 android { applicationVariants.all { variant -> variant.outputs.each { output -> ...

JonathanHsia 1078

电磁场仿真软件:Sonnet_(12).Sonnet与其他软件的集成

Sonnet作为电磁场仿真领域的强大工具,不仅能够独立完成复杂的仿真任务,还可以通过与其他软件的集成,实现更高效的工作流程和更广泛的功能扩展。通过与CAD、EDA、数据处理软件、MATLAB、Python以及云计算平台的集成,Sonnet用户可以更好地利用现有设计资源,进行参数优化和结果分析,从而提升设计和仿真效率。希望本节的内容能够帮助你更好地理解和应用Sonnet的集成功能。

kkchenjj的博客 1426

AndroidStudio编译Taglib源码中遇到的一些问题

系统Ubuntu18.04 AndroidStudio版本3.2.1 NDK:android-ndk-r10e,未使用最新的ndk,貌似最新的有些问题 Taglib是最新的taglib-1.11.1 第一次在AndroidStuido中编译第三方库,遇到的主要问题如下: 1.只是从Build菜单执行Make Project或者Rebuild Project,报错信息如下: Proces...

蓝蓝的天 1299

「自然语言驱动生产力」23. 科研神器:DeepSeek+EndNote实现文献智能综述

摘要:传统文献综述面临周期长、漏检率高、数据整合繁琐等痛点,某985课题组数据显示,4人团队完成一篇综述平均需5个月,重要成果遗漏率达25%。本文提出基于DeepSeek+EndNote的智能综述方案,通过“自然语言解析→精准检索→智能筛选→自动生成”四步流程实现全自动化。核心技术包括检索式智能生成算法、文献优先级评分模型、可视化图表自动生成工具及结构化综述框架引擎。实际应用中,文献调研周期从3-6个月缩短至2周,重要成果遗漏率降至3%以下,图表制作时间完全解放。某课题组采用该方案后,1人3周完成的综述被A

专注于人工智能、软件开发、工控自动化、工厂数字化及智能化等领域,希望和大家共同进步! 1653

32、社交媒体大数据中的情感分析与网络欺凌检测

本文探讨了社交媒体大数据在情感分析和网络欺凌检测中的应用。情感分析有助于应对自动化带来的社会变化、促进社会包容和推动环境保护。网络欺凌作为一种严重的在线危害,其检测依赖于数据预处理、特征提取与深度学习模型(如CNN、LSTM)进行分类。文章还总结了大数据在欺诈检测、医疗、制造、交通等领域的广泛应用,并分析了数据存储、处理速度、质量和技术工具等方面的挑战,提出了相应的应对策略。未来,随着技术进步,社交媒体大数据将在更多领域发挥关键作用。

cc789的博客 84

更新AndroidStudio到3.0后遇到的一个编译问题Error: java.util.concurrent.ExecutionException: com.android.tools.aapt2

今天晚上更新了AndroidStudio,可是再用这个就发现一个编译问题: Error:java.util.concurrent.ExecutionException: com.android.tools.aapt2.Aapt2Exception: AAPT2 error: check logs for details Error:Execution failed for task ':app

qq_36304617的博客 4万+

TMS_WebGMaps_1.9.8.0_Full_Source

TMS_WebGMaps_1.9.8.0_Full_Source 全源码 delphi cbuilder

AndroidStudio编译时出现cvc-complex-type.2.4.a:发现了以元素‘extension-level‘开头的无效内容的问题

后来发现是自己上班摸鱼的时候,构建了一个新的空壳项目时,使用的是最新的gradle和sdk,所以在编译的时候,同时把公司项目中的 ndk.dir=D\:\\sdk\\ndk-bundle这一行配置自动删除了,导致ndk编译失败导致的,只要把ndk路径重新配置上就可以了。网上说的很多办法都大同小异,我试了不管用,因为项目比较老,所以升级gradle会带来很多麻烦,项目又着急开发,所以时间上不允许。

qq_16252123的博客 4324

SAP B1中文培訓教材_SDK

公司内部培训资料,对开发工具 ,DIAPI, UIAPI,Add-ON有详细解说

怀旧版电脑GBC模拟器

再现原版GBC掌机的界面,电脑运行连游戏界面都一样大小,很怀旧,很真实,(英文版)强烈推荐,很小的文件,很难才找到的。

Failed to resolve : com.android.support:appcompat-v7:24.2.0

1 开发环境 Ubuntu14.04(64bit) Android Studio 2.2.2 2 问题描述 在编译我的第一个项目的时候,提示: 3 解决方法 根据参考资料[1][2]的提示,需要通过Android SDK Manager安装Android Support Repository: 参考资料 [1]Failed to find :...

OneSea 6902

深度学习工具包 DeepLearningToolbox

深度学习工具包Deprecation notice.-----This toolbox is outdated and no longer maintained.There are much better tools available for deep learning than this toolbox, e.g. [Theano](http://deeplearning.net/software/theano/), [torch](http://torch.ch/) or [tensorflow](http://www.tensorflow.org/)I would suggest you use one of the tools mentioned above rather than use this toolbox.Best, Rasmus.DeepLearnToolbox================A Matlab toolbox for Deep Learning.Deep Learning is a new subfield of machine learning that focuses on learning deep hierarchical models of data.It is inspired by the human brain's apparent deep (layered, hierarchical) architecture.A good overview of the theory of Deep Learning theory is[Learning Deep Architectures for AI](http://www.iro.umontreal.ca/~bengioy/papers/ftml_book.pdf)For a more informal introduction, see the following videos by Geoffrey Hinton and Andrew Ng.* [The Next Generation of Neural Networks](http://www.youtube.com/watch?v=AyzOUbkUf3M) (Hinton, 2007)* [Recent Developments in Deep Learning](http://www.youtube.com/watch?v=VdIURAu1-aU) (Hinton, 2010)* [Unsupervised Feature Learning and Deep Learning](http://www.youtube.com/watch?v=ZmNOAtZIgIk) (Ng, 2011)If you use this toolbox in your research please cite [Prediction as a candidate for learning deep hierarchical models of data](http://www2.imm.dtu.dk/pubdb/views/publication_details.php?id=6284)```@MASTERSTHESIS\{IMM2012-06284, author = "R. B. Palm", title = "Prediction as a candidate for learning deep hierarchical models of data", year = "2012",}```Contact: rasmusbergpalm at gmail dot comDirectories included in the toolbox-----------------------------------`NN/` - A library for Feedforward Backpropagation Neural Networks`CNN/` - A library for Convolutional Neural Networks`DBN/` - A library for Deep Belief Networks`SAE/` - A library for Stacked Auto-Encoders`CAE/` - A library for Convolutional Auto-Encoders`util/` - Utility functions used by the libraries`data/` - Data used by the examples`tests/` - unit tests to verify toolbox is workingFor references on each library check REFS.mdSetup-----1. Download.2. addpath(genpath('DeepLearnToolbox'));Example: Deep Belief Network---------------------```matlabfunction test_example_DBNload mnist_uint8;train_x = double(train_x) / 255;test_x = double(test_x) / 255;train_y = double(train_y);test_y = double(test_y);%% ex1 train a 100 hidden unit RBM and visualize its weightsrand('state',0)dbn.sizes = [100];opts.numepochs = 1;opts.batchsize = 100;opts.momentum = 0;opts.alpha = 1;dbn = dbnsetup(dbn, train_x, opts);dbn = dbntrain(dbn, train_x, opts);figure; visualize(dbn.rbm{1}.W'); % Visualize the RBM weights%% ex2 train a 100-100 hidden unit DBN and use its weights to initialize a NNrand('state',0)%train dbndbn.sizes = [100 100];opts.numepochs = 1;opts.batchsize = 100;opts.momentum = 0;opts.alpha = 1;dbn = dbnsetup(dbn, train_x, opts);dbn = dbntrain(dbn, train_x, opts);%unfold dbn to nnnn = dbnunfoldtonn(dbn, 10);nn.activation_function = 'sigm';%train nnopts.numepochs = 1;opts.batchsize = 100;nn = nntrain(nn, train_x, train_y, opts);[er, bad] = nntest(nn, test_x, test_y);assert(er < 0.10, 'Too big error');```Example: Stacked Auto-Encoders---------------------```matlabfunction test_example_SAEload mnist_uint8;train_x = double(train_x)/255;test_x = double(test_x)/255;train_y = double(train_y);test_y = double(test_y);%% ex1 train a 100 hidden unit SDAE and use it to initialize a FFNN% Setup and train a stacked denoising autoencoder (SDAE)rand('state',0)sae = saesetup([784 100]);sae.ae{1}.activation_function = 'sigm';sae.ae{1}.learningRate = 1;sae.ae{1}.inputZeroMaskedFraction = 0.5;opts.numepochs = 1;opts.batchsize = 100;sae = saetrain(sae, train_x, opts);visualize(sae.ae{1}.W{1}(:,2:end)')% Use the SDAE to initialize a FFNNnn = nnsetup([784 100 10]);nn.activation_function = 'sigm';nn.learningRate = 1;nn.W{1} = sae.ae{1}.W{1};% Train the FFNNopts.numepochs = 1;opts.batchsize = 100;nn = nntrain(nn, train_x, train_y, opts);[er, bad] = nntest(nn, test_x, test_y);assert(er < 0.16, 'Too big error');```Example: Convolutional Neural Nets---------------------```matlabfunction test_example_CNNload mnist_uint8;train_x = double(reshape(train_x',28,28,60000))/255;test_x = double(reshape(test_x',28,28,10000))/255;train_y = double(train_y');test_y = double(test_y');%% ex1 Train a 6c-2s-12c-2s Convolutional neural network %will run 1 epoch in about 200 second and get around 11% error. %With 100 epochs you'll get around 1.2% errorrand('state',0)cnn.layers = { struct('type', 'i') %input layer struct('type', 'c', 'outputmaps', 6, 'kernelsize', 5) %convolution layer struct('type', 's', 'scale', 2) %sub sampling layer struct('type', 'c', 'outputmaps', 12, 'kernelsize', 5) %convolution layer struct('type', 's', 'scale', 2) %subsampling layer};cnn = cnnsetup(cnn, train_x, train_y);opts.alpha = 1;opts.batchsize = 50;opts.numepochs = 1;cnn = cnntrain(cnn, train_x, train_y, opts);[er, bad] = cnntest(cnn, test_x, test_y);%plot mean squared errorfigure; plot(cnn.rL);assert(er<0.12, 'Too big error');```Example: Neural Networks---------------------```matlabfunction test_example_NNload mnist_uint8;train_x = double(train_x) / 255;test_x = double(test_x) / 255;train_y = double(train_y);test_y = double(test_y);% normalize[train_x, mu, sigma] = zscore(train_x);test_x = normalize(test_x, mu, sigma);%% ex1 vanilla neural netrand('state',0)nn = nnsetup([784 100 10]);opts.numepochs = 1; % Number of full sweeps through dataopts.batchsize = 100; % Take a mean gradient step over this many samples[nn, L] = nntrain(nn, train_x, train_y, opts);[er, bad] = nntest(nn, test_x, test_y);assert(er < 0.08, 'Too big error');%% ex2 neural net with L2 weight decayrand('state',0)nn = nnsetup([784 100 10]);nn.weightPenaltyL2 = 1e-4; % L2 weight decayopts.numepochs = 1; % Number of full sweeps through dataopts.batchsize = 100; % Take a mean gradient step over this many samplesnn = nntrain(nn, train_x, train_y, opts);[er, bad] = nntest(nn, test_x, test_y);assert(er < 0.1, 'Too big error');%% ex3 neural net with dropoutrand('state',0)nn = nnsetup([784 100 10]);nn.dropoutFraction = 0.5; % Dropout fraction opts.numepochs = 1; % Number of full sweeps through dataopts.batchsize = 100; % Take a mean gradient step over this many samplesnn = nntrain(nn, train_x, train_y, opts);[er, bad] = nntest(nn, test_x, test_y);assert(er < 0.1, 'Too big error');%% ex4 neural net with sigmoid activation functionrand('state',0)nn = nnsetup([784 100 10]);nn.activation_function = 'sigm'; % Sigmoid activation functionnn.learningRate = 1; % Sigm require a lower learning rateopts.numepochs = 1; % Number of full sweeps through dataopts.batchsize = 100; % Take a mean gradient step over this many samplesnn = nntrain(nn, train_x, train_y, opts);[er, bad] = nntest(nn, test_x, test_y);assert(er < 0.1, 'Too big error');%% ex5 plotting functionalityrand('state',0)nn = nnsetup([784 20 10]);opts.numepochs = 5; % Number of full sweeps through datann.output = 'softmax'; % use softmax outputopts.batchsize = 1000; % Take a mean gradient step over this many samplesopts.plot = 1; % enable plottingnn = nntrain(nn, train_x, train_y, opts);[er, bad] = nntest(nn, test_x, test_y);assert(er < 0.1, 'Too big error');%% ex6 neural net with sigmoid activation and plotting of validation and training error% split training data into training and validation datavx = train_x(1:10000,:);tx = train_x(10001:end,:);vy = train_y(1:10000,:);ty = train_y(10001:end,:);rand('state',0)nn = nnsetup([784 20 10]); nn.output = 'softmax'; % use softmax outputopts.numepochs = 5; % Number of full sweeps through dataopts.batchsize = 1000; % Take a mean gradient step over this many samplesopts.plot = 1; % enable plottingnn = nntrain(nn, tx, ty, opts, vx, vy); % nntrain takes validation set as last two arguments (optionally)[er, bad] = nntest(nn, test_x, test_y);assert(er < 0.1, 'Too big error');```[![Bitdeli Badge](https://d2weczhvl823v0.cloudfront.net/rasmusbergpalm/deeplearntoolbox/trend.png)](https://bitdeli.com/free "Bitdeli Badge")

Android Studio3(2)

解决方案详解在这里:https://asyoulook.com/computers%20&%20internet/android-unable-to-merge-dex/82120解决方案:修改文件名代码请这样写defaultConfigversionName解决方案:在gradle.properties中关闭APPT2 编译。

2401_84010784的博客 1101

Android 13 DreamCamera2在Android studio中运行

Android 13 DreamCamera2在Android studio中运行

wzx311的博客 966

AndroidStudio问题之解决Error:java.util.concurrent.ExecutionException: com.android.tools.aapt2...

大二上的寒假跟着老师开始了安卓开发,然后大四课有移动开发emmm,所以打算提前开始着手先把大作业写一写,不料本人再次打开尘封已久的AndroidStdio时它竟然上来报bug。咋回事,这是来个下马威咋滴?! 废话不多说了,开始正式陈述问题,如果你像我一样打开AS时出现了如下问题

爱放火的安小妮的博客 2379

关于AAPT2 error: check logs for details 的问题分析定位与排查解决方法

一般都是jar包冲突导致的,尤其是support包,但是每次解决的时候,要么是误打误撞搞定,要么是懵里懵逼的解决。那就可能是,我们项目中的依赖包内依赖了不同的版本。待Fetching Gradle build models 消失后,就能看到dependencies中会存在多个依赖的列表,点击列表,就能在最右侧的框框里看到这个依赖包是谁引入的。首先看studio的编译日志,如果能从编译日志中看出具体冲突的jar包,就可以根据具体jar包找对应的模块进行进一步的排查分析了。找那些有多个版本的依赖包,如下图。

进击的码字猴 810

android 删除模块,Android Studio 2.3删除模块引用(Android Studio 2.3 removes module references)...

Android Studio 2.3删除模块引用(Android Studio 2.3 removes module references)我有一个Android项目,由多个模块组成。 我不使用Gradle 。使用Android 2.2.3,该项目运行良好,但我将Android Studio更新为2.3。当我加载主项目时,我收到了以下消息:Update Property FilesThe stru...

weixin_42143806的博客 331

AndroidStudio运行Build Output乱码问题解决

AndroidStudio运行Build Output乱码问题解决 问题如下图: 解决步骤: 1、打开文件(操作路径如下图所示):studio64.exe.vmoptions(32位系统为studio32.exe.vmoption),如果没有该文件会提示你创建该文件,新建完成之后在文件中输入如下内容: -Dfile.encoding=UTF-8 具体操作操作如图: 2、连接手机编译运行项目(一定要编译运行)如图: 3、编译运行后不再显示乱码,但是依然出现类似下图的报错问题,这时候

博客,是nsacer先森的 1841
上一篇: 世上从来都不缺知识,只是缺坚持
下一篇: MVP模式研究与实践
高的世界
高的世界 领域专家: 操作系统技术领域 领域专家: 操作系统技术领域
博客等级 码龄14年 325粉丝 39原创
评论 2
成就一亿技术人!
拼手气红包6.0元
还能输入1000个字符
 
 条评论被折叠 查看
添加红包

请填写红包祝福语或标题

个

红包个数最小为10个

元

红包金额最低5元

当前余额3.43元 前往充值 >
需支付:10.00元
成就一亿技术人!
领取后你会自动成为博主和红包主的粉丝 规则
hope_wisdom
发出的红包
实付元
使用余额支付
点击重新获取
扫码支付
钱包余额 0

抵扣说明:

1.余额是钱包充值的虚拟货币,按照1:1的比例进行支付金额的抵扣。
2.余额无法直接购买下载,可以购买VIP、付费专栏及课程。

余额充值